{"text_format":"1","workbook":"xlsx","n_sheets":3,"sheets":["Calcul","Détail des calculs - STD","Détail des calculs - PERF"],"not_rendered":{"charts":0,"images":2,"macros":1,"external_links":0,"defined_names":50,"comments":0,"pivot_tables":0},"unopened":[],"bounds":{"document_bytes":16777216,"sheet_cells":100000,"rows_first":2000,"rows_last":500,"rows_between":2000,"halvings":0,"cell_chars":16384,"cell_head_chars":4096},"cells_cut":0,"cells_raw":0,"read":"whole","date_system":"1900"}

{"sheet":"Calcul","index":0,"n_rows":215,"n_cols":25,"rows_kept":215,"cut":false,"hidden":false,"merged":[[17,0,17,5],[52,0,52,5],[85,0,85,5],[0,0,0,5],[1,0,1,5],[2,0,2,5],[3,0,3,5],[32,0,32,1],[7,0,7,5],[13,0,13,1],[16,0,16,1],[45,1,45,2],[41,1,41,2],[43,1,43,2],[44,10,46,12],[211,0,211,5],[214,0,214,5],[209,13,209,14],[84,0,84,5],[137,0,137,5],[196,3,196,4],[202,0,202,5],[207,0,207,5],[77,0,77,5],[49,1,49,2]]}
[{"$f":"IF($H$6=1,U1,V1)","v":"Bienvenue dans le calculateur en ligne des bourses et prêts d’études du canton du Valais. "},null,null,null,null,null,null,null,null,null,null,null,null,null,null,null,null,null,null,null,"Bienvenue dans le calculateur en ligne des bourses et prêts d’études du canton du Valais. ","Herzlich willkommen beim Online-Rechner des Kantons Wallis! "]
[{"$f":"IF($H$6=1,U2,V2)","v":"Ce calculateur est mis à disposition par la section des bourses et prêts d’études."},null,null,null,null,null,null,null,null,null,null,null,null,null,null,null,null,null,null,null,"Ce calculateur est mis à disposition par la section des bourses et prêts d’études.","Dieses Tool zur Berechnung Ihres Stipendien- oder Darlehensanspruchs wird Ihnen von der Sektion Stipendien und Ausbildungsdarlehen zur Verfügung gestellt."]
[{"$f":"IF($H$6=1,U3,V3)","v":"Le calcul des bourses et/ou prêt s d’études vous est présenté à titre indicatif !\nIl n'engage en aucun cas l'Administration cantonale, ni la Commission des Bourses et des Prêts d'études, car les bourses et prêts d’études sont calculés par l'autorité compétente sur la base des documents à fournir par le requérant, notamment la taxation définitive des parents, les gains du requérant, le nombre d’enfants à charge et en formation, etc..."},null,null,null,null,null,null,null,null,null,null,null,null,null,null,null,null,null,null,null,"Le calcul des bourses et/ou prêt s d’études vous est présenté à titre indicatif !\nIl n'engage en aucun cas l'Administration cantonale, ni la Commission des Bourses et des Prêts d'études, car les bourses et prêts d’études sont calculés par l'autorité compétente sur la base des documents à fournir par le requérant, notamment la taxation définitive des parents, les gains du requérant, le nombre d’enfants à charge et en formation, etc...","Bitte beachten Sie, dass das errechnete Ergebnis unverbindlich ist und lediglich als Anhaltspunkt dient.\nDa sich die zuständige Behörde bei der Berechnung der Stipendien und Ausbildungsdarlehen auf die vom Antragsteller eingereichten Dokumente (wie Steuerverfügung der Eltern, Einkommen des Antragstellers, Anzahl unterhaltsberechtigter oder sich in Ausbildung befindlicher Kinder) stützt, hat das Ergebnis des Online-Rechners weder für die Kantonsverwaltung noch für die Kommission für Ausbildungsbeiträge eine Verpflichtung zur Folge."]
[{"$f":"IF($H$6=1,U4,V4)","v":"Le résultat du calcul correspond à une estimation basée sur les données que vous allez insérer. Des éléments de votre situation personnelle peuvent ne pas être pris en considération par le calculateur.\n\nPour compléter le calcul, vous avez besoin de la taxation fiscale de vos parents et du montant de vos gains durant l’année scolaire. Les données sont à indiquer pour une année de formation complète.\nCertaines situations plus complexes, comme celles qui concernent la répartition des enfants dans les ménages lorsque les parents sont séparés, notamment lors de garde partagée ainsi que la détermination de l’indépendance partielle ou non des prestations parentales ont été intégrées au calculateur. Toutefois, elles peuvent être sujette à une interprétation erronée de votre part et conduire à un résultat incorrect.\n\nPour d’autres conditions à remplir pour l’octroi d’une bourse (reconnaissance de la formation, reconnaissance de l’établissement de formation, compétence du canton, …), veuillez contacter la section des bourses et prêts d'études.\n"},null,null,null,null,null,null,null,null,null,null,null,null,null,null,null,null,null,null,null,"Le résultat du calcul correspond à une estimation basée sur les données que vous allez insérer. Des éléments de votre situation personnelle peuvent ne pas être pris en considération par le calculateur.\n\nPour compléter le calcul, vous avez besoin de la taxation fiscale de vos parents et du montant de vos gains durant l’année scolaire. Les données sont à indiquer pour une année de formation complète.\nCertaines situations plus complexes, comme celles qui concernent la répartition des enfants dans les ménages lorsque les parents sont séparés, notamment lors de garde partagée ainsi que la détermination de l’indépendance partielle ou non des prestations parentales ont été intégrées au calculateur. Toutefois, elles peuvent être sujette à une interprétation erronée de votre part et conduire à un résultat incorrect.\n\nPour d’autres conditions à remplir pour l’octroi d’une bourse (reconnaissance de la formation, reconnaissance de l’établissement de formation, compétence du canton, …), veuillez contacter la section des bourses et prêts d'études.\n","Das Resultat ist eine Schätzung, die sich auf die von Ihnen gemachten Angaben stützt. Ihre persönliche Situation kann vom Online-Rechner leider nicht berücksichtigt werden.\n\nUm die Berechnung durchzuführen, benötigen Sie die Steuerveranlagung Ihrer Eltern sowie das Einkommen, das Sie während des Schuljahrs allenfalls erarbeitet haben. Die Angaben sind jeweils für ein Ausbildungsjahr anzugeben.\nAuch kompliziertere Fälle, wie die Aufteilung von Kindern bei getrennt lebenden Eltern mit gemeinsamem Sorgerecht oder die Bestimmung einer teilweisen Unabhängigkeit von den elterlichen Leistungen, können vom Rechner bearbeitet werden. Eine unkorrekte Auslegung dieser Informationen Ihrerseits kann zu einem falschen Ergebnis führen.\n\nAuf Anfrage teilt Ihnen die Sektion Stipendien und Ausbildungsdarlehen gerne die weiteren Bedingungen für die Gewährung eines Stipendiums (Anerkennung der Ausbildung, Anerkennung der Bildungseinrichtung, Zuständigkeit des Kantons, ...) mit."]
[null,null,null,null,null,null,null,null,null,null,null,null,null,"Année calculateur",{"$f":"IF(MONTH(O10)>=6,YEAR(O10)&\"/\"& YEAR(O10)+1,YEAR(O10)-1&\"/\"&YEAR(O10))","v":"2023/2024"}]
[{"$f":"IF($H$6=1,U6,V6)","v":"Année de formation"},{"$f":"O5","v":"2023/2024"},null,null,null,"FR",null,{"$f":"VLOOKUP(F6,N5:N6:O7,2,FALSE)","v":1},null,null,null,null,null,"FR",1,null,null,null,null,null,"Année de formation","Schuljahr"]
[null,null,null,null,null,null,null,null,null,null,null,null,null,"DE",2]
[{"$f":"IF($H$6=1,U8,V8)","v":"Veuillez compléter toutes les cellules de couleurs grises et oranges ci-dessous !\n - Dans les cellules en gris, vous devez sélectionner une des valeurs présentes.\n - Dans les cellules oranges, vous devez saisir des nombres entiers."},{"$f":"IF($H$6=1,V8,V9)","v":"Vervollständigen Sie bitte alle nachfolgenden Felder in grau und orange.\n - Bei den grauen Feldern wählen Sie bitte eine Option aus.\n - In die orangen Felder geben Sie bitte eine ganze Zahl ein."},{"$f":"IF($H$6=1,V9,X8)","v":" - Dans les cellules vertes, vous devez saisir du texte.\n - In die grünen Felder geben Sie bitte einen Text ein."},0,0,0,null,null,null,null,null,null,null,null,null,null,null,null,null,null,"Veuillez compléter toutes les cellules de couleurs grises et oranges ci-dessous !\n - Dans les cellules en gris, vous devez sélectionner une des valeurs présentes.\n - Dans les cellules oranges, vous devez saisir des nombres entiers.","Vervollständigen Sie bitte alle nachfolgenden Felder in grau und orange.\n - Bei den grauen Feldern wählen Sie bitte eine Option aus.\n - In die orangen Felder geben Sie bitte eine ganze Zahl ein."]
[null,null,null,null,null,null,null,null,null,null,null,null,null,null,null,null,"FR","DE",null,null,null," - Dans les cellules vertes, vous devez saisir du texte.\n - In die grünen Felder geben Sie bitte einen Text ein."]
[null,null,null,null,null,null,null,null,null,null,null,null,null,"Aujourd'hui",{"$f":"TODAY()","v":"2023-07-03"}]
[{"$f":"IF($H$6=1,U11,V11)","v":"Formation et catégorie de frais"},null,null,null,null,null,null,null,null,null,null,null,null,"Année taxation",{"$f":"IF(MONTH(O10)>=6,YEAR(O10)-2,YEAR(O10)-3)","v":2021},null,null,null,null,null,"Formation et catégorie de frais","Ausbildung und Kostenkategorie"]
[]
[{"$f":"IF($H$6=1,U13,V13)","v":"Type de formation envisagée"},null,null,null,null,null,null,null,null,null,null,null,null,{"$f":"IF($H$6=1,Q13,R13)","v":"Fréquentation d'une classe du cycle d'orientation dans une autre région linguistique ou d'une structure sport-arts-formation"},1,null,"Fréquentation d'une classe du cycle d'orientation dans une autre région linguistique ou d'une structure sport-arts-formation","Besuch einer OS-Klasse in einer anderen Sprachregion oder einer Sport-Kunst-Ausbildungsstruktur ",null,null,"Type de formation envisagée","Art der geplanten Ausbildung"]
["Formation secondaire du deuxième degré (Collège, ECCG, Ecoles profesionnelles à plein temps, …)",null,null,null,null,null,null,{"$f":"VLOOKUP(A14,N13:O18,2,FALSE)","v":1},null,null,null,null,null,"Ecoles préparatoires (écoles préprofessionnelles, …)",1,null,"Ecoles préparatoires (écoles préprofessionnelles, …)","Vorbereitende Schule (Schule für Berufsvorbereitung, ...) "]
[null,null,null,null,null,null,null,null,null,null,null,null,null,"Apprentissage",1,null,"Apprentissage","Berufslehre "]
[{"$f":"IF($H$6=1,U16,V16)","v":"Type d'école"},null,null,null,null,null,null,null,null,null,null,null,null,"Formation secondaire du deuxième degré (Collège, ECCG, Ecoles profesionnelles à plein temps, …)",1,null,"Formation secondaire du deuxième degré (Collège, ECCG, Ecoles profesionnelles à plein temps, …)","Mittelschulausbildung (Kollegium, FMS, HMS, Berufliche Bildung (vollschulisch),...) ",null,null,"Type d'école","Art der Schule"]
["Publique",null,null,null,null,null,null,{"$f":"VLOOKUP(A17,N20:O21,2,FALSE)","v":1},null,null,null,null,null,"Formation tertiaire (Université, HES, ES, …)",2,null,"Formation tertiaire (Université, HES, ES, …)","Tertiäre Ausbildung"]
[{"$f":"IF($H$6=1,U18,V18)","v":"A compléter uniquement s'il s'agit d'un perfectionnement en emploi (Inclure tous les frais liés au cours) ou si la formation est suivie dans une école privée (uniquement les frais d'écolage)"},{"$f":"IF($H$6=1,V18,W28)","v":"Nur ausfüllen, wenn es sich um eine berufsbegleitende Weiterbildung handelt (alle mit dem Kurs verbundenen Kosten einschliessen) oder die Ausbildung von einer Privatschule angeboten wird (nur Schulgeld)."},{"$f":"IF($H$6=1,W28,X28)","v":0},{"$f":"IF($H$6=1,X28,Y28)","v":0},{"$f":"IF($H$6=1,Y28,Z28)","v":0},{"$f":"IF($H$6=1,Z28,AA28)","v":0},null,null,null,null,null,null,null,"Perfectionnement",4,null,"Perfectionnement","Weiterbildungen",null,null,"A compléter uniquement s'il s'agit d'un perfectionnement en emploi (Inclure tous les frais liés au cours) ou si la formation est suivie dans une école privée (uniquement les frais d'écolage)","Nur ausfüllen, wenn es sich um eine berufsbegleitende Weiterbildung handelt (alle mit dem Kurs verbundenen Kosten einschliessen) oder die Ausbildung von einer Privatschule angeboten wird (nur Schulgeld)."]
[{"$f":"IF($H$6=1,U19,V19)","v":"Ecolage"},0,null,null,null,null,null,{"$f":"IF(H17=2,IF(B19>6000,MROUND(MIN(B19-6000,5000),10),0),0)","v":0},null,null,null,null,null,null,null,null,null,null,null,null,"Ecolage","Schulkosten"]
[null,null,null,null,null,null,null,null,null,null,null,null,null,{"$f":"IF($H$6=1,Q20,R20)","v":"Publique"},1,null,"Publique","Öffentliche Schule"]
[{"$f":"IF($H$6=1,U21,V21)","v":"Frais liés à la formation"},null,null,null,null,null,null,null,null,null,null,null,null,{"$f":"IF($H$6=1,Q21,R21)","v":"Privée"},2,null,"Privée","Private Schule ",null,null,"Frais liés à la formation","Kosten in Verbindung mit der Ausbildung"]
[]
[{"$f":"IF($H$6=1,U23,V23)","v":"Frais de logement hors du domicile des parents"},"Non",null,null,null,null,null,{"$f":"VLOOKUP(B23,N23:O24,2,FALSE)","v":0},"0=non | 1=oui",null,null,null,null,{"$f":"IF($H$6=1,Q23,R23)","v":"Non"},0,null,"Non","Nein",null,null,"Frais de logement hors du domicile des parents","Kosten Unterkunft ausserhalb Wohnort der Eltern"]
[{"$f":"IF($H$6=1,U24,V24)","v":"Montant annuel du loyer"},0,null,null,null,null,null,{"$f":"MIN(B24,VLOOKUP(J46,$N$144:$Q$161,4,FALSE))","v":0},null,null,null,null,null,{"$f":"IF($H$6=1,Q24,R24)","v":"Oui"},1,null,"Oui","Ja",null,null,"Montant annuel du loyer","Jährlicher Mietzins"]
[]
[{"$f":"IF($H$6=1,U26,V26)","v":"Frais de formation"},{"$f":"IF(H17=1,IF(H14=1,2500,IF(H14=2,3000,0)),IF(H14=1,2500+H19,IF(H14=2,3000+H19,0)))","v":2500},null,null,null,null,null,null,null,null,null,null,null,null,null,null,null,null,null,null,"Frais de formation","Ausbildungskosten"]
[]
[{"$f":"IF($H$6=1,U28,V28)","v":"Frais de repas"},{"$f":"IF(H14<>4,IF(H23=1,3600,2200),0)","v":2200},null,null,null,null,null,null,null,null,null,null,null,null,null,null,null,null,null,null,"Frais de repas","Verpflegungskosten"]
[]
[{"$f":"IF($H$6=1,U30,V30)","v":"Frais de déplacement"},0,null,null,null,null,null,null,null,null,null,null,null,null,null,null,null,null,null,null,"Frais de déplacement","Reisespesen"]
[]
[{"$f":"IF($H$6=1,U32,V32)","v":"Nombre de semestres durant l'année de formation"},null,null,null,null,null,null,null,null,null,null,null,null,1,1,null,null,null,null,null,"Nombre de semestres durant l'année de formation","Anzahl Semester während dem Ausbildungsjahr"]
[2,null,null,null,null,null,null,{"$f":"VLOOKUP(A33,N32:O33,2,FALSE)","v":2},null,null,null,null,null,2,2]
[]
[]
[]
[{"$f":"IF($H$6=1,U37,V37)","v":"Frais liés à la formation"},{"$f":"IF(H14<>4,IF(H23=1,SUM(H24,B26,B28,B30),SUM(B26,B28,B30)),B19+B30)","v":4700},null,null,null,null,null,null,null,null,null,null,null,null,null,null,null,null,null,null,"Frais liés à la formation","Kosten in Verbindung mit der Ausbildung"]
[]
[]
[{"$f":"IF($H$6=1,U40,V40)","v":"Situation de la personne en formation"},null,null,null,null,null,null,null,null,null,null,null,null,null,null,null,null,null,null,null,"Situation de la personne en formation","Situation der Person in Ausbildung"]
{"$rows_left_out":176}
{"sheet":"Détail des calculs - STD","index":1,"n_rows":129,"n_cols":8,"rows_kept":129,"cut":false,"hidden":true,"merged":[]}
[null,null,null,null,"Sion, le ",{"$f":"TODAY()","v":"2023-07-03"}]
["Détail des calculs"]
[]
["Année scolaire",null,{"$f":"Calcul!B6","v":"2023/2024"}]
[]
["N° Référence",null,{"$f":"Calcul!I42","v":0}]
["Nom - Prénom",null,{"$f":"CONCATENATE(Calcul!B42,\" \",Calcul!B44)","v":" "}]
["Etat civil",null,{"$f":"Calcul!B46","v":"Célibataire"}]
[]
[]
["Besoins de la famille ",null,null,null,{"$f":"IF(Calcul!H78=1,\"Parents\",IF(Calcul!H78=2,\"Mère\",IF(Calcul!H78=3,\"Père\",\"Père\")))","v":"Parents"},{"$f":"IF(Calcul!H78=4,\"Mère\",\"\")","v":""},null,"Ordonnance"]
["Nombre de parents",null,null,null,{"$f":"Calcul!C142","v":0},{"$f":"Calcul!D142","v":0}]
["Nombre d'enfants à charge",null,null,null,{"$f":"Calcul!#REF!","v":{"$error":"#REF!"}},{"$f":"Calcul!#REF!","v":{"$error":"#REF!"}}]
["Nombre de personnes dans le ménage",null,null,null,{"$f":"E12+E13","v":{"$error":"#REF!"}},{"$f":"F12+F13","v":{"$error":"#REF!"}}]
[]
["Nombre d'enfants en formation post-obligatoire",null,null,null,{"$f":"Calcul!C149","v":0},{"$f":"Calcul!D149","v":0}]
[]
["Besoins admis de la famille ",null,null,null,{"$f":"Calcul!C156","v":0},{"$f":"Calcul!D156","v":0},null,"Annexe II"]
["Supplément de formation (1'800.- / enfants en formation p.-o.)",null,null,null,{"$f":"Calcul!C160","v":0},{"$f":"Calcul!D160","v":0},null,"Art. 7.2"]
["Besoins de la famille",null,null,null,{"$f":"E18+E19","v":0},{"$f":"F18+F19","v":0}]
[]
[{"$f":"CONCATENATE(\"Revenu déterminant des parents   (Base : Taxation \", Calcul!O11, \")\")","v":"Revenu déterminant des parents   (Base : Taxation 2021)"}]
["Revenu net  (2400)",null,null,"+",{"$f":"Calcul!C89","v":0},{"$f":"Calcul!D89","v":0},null,"Art. 6.1"]
["Fortune brute  (3500)",null,null,null,{"$f":"Calcul!C91","v":0},{"$f":"Calcul!D91","v":0}]
["Bâtiment privés  (2920,2922)",null,null,null,{"$f":"Calcul!C98","v":0},{"$f":"Calcul!D98","v":0}]
["Fortune revalorisée brute",null,null,null,{"$f":"Calcul!C116","v":0},{"$f":"Calcul!D116","v":0}]
["Dette  (4000)",null,null,null,{"$f":"Calcul!C99","v":0},{"$f":"Calcul!D99","v":0}]
["Fortune revalorisée nette",null,null,null,{"$f":"Calcul!C117","v":0},{"$f":"Calcul!D117","v":0}]
["Revenu de la fortune (5 % fortune revalorisée nette)",null,null,"+",{"$f":"Calcul!C125","v":0},{"$f":"Calcul!D125","v":0}]
["Pilier 3a  (2210,2220)",null,null,"+",{"$f":"Calcul!C105","v":0},{"$f":"Calcul!D105","v":0}]
["Revenu négatif de la fortune immobilière  (1110,1120,1130)",null,null,"+",{"$f":"Calcul!C120","v":0},{"$f":"Calcul!D120","v":0}]
["Pensions alimentaires versées  (2531)",null,null,"-",{"$f":"Calcul!C110","v":0},{"$f":"Calcul!D110","v":0}]
["Prestations en capital reçues  (1010,1020)",null,null,"-",{"$f":"Calcul!C113","v":0},{"$f":"Calcul!D113","v":0}]
["Revenu déterminant calculé",null,null,null,{"$f":"E23+E29+E30+E31-E32-E33","v":0},{"$f":"F23+F29+F30+F31-F32-F33","v":0}]
[]
["Revenu déterminant",null,null,null,{"$f":"ROUNDDOWN(E34,-2)","v":0},{"$f":"ROUNDDOWN(F34,-2)","v":0}]
[]
["Contribution des parents"]
["Prise en compte des prestations parentales ",null,null,null,{"$f":"IF(E36<180000,IF(Calcul!H52=0,\"Oui\",\"Non\"),IF(Calcul!H52=1,\"Revenu >180'000\",\"Oui\"))","v":"Oui"},{"$f":"E39","v":"Oui"},null,{"$f":"IF(E39=\"Revenu >180'000\",\"Art. 12.3\",\"Art. 12\")","v":"Art. 12"}]
[]
{"$rows_left_out":90}
{"sheet":"Détail des calculs - PERF","index":2,"n_rows":80,"n_cols":13,"rows_kept":80,"cut":false,"hidden":true,"merged":[[19,7,48,7],[52,0,55,7]]}
[null,null,null,null,"Sion, le ",{"$f":"TODAY()","v":"2023-07-03"}]
["Détail des calculs"]
[]
["Année scolaire",null,{"$f":"Calcul!B6","v":"2023/2024"},null,null,null,null,null,null,null,null,"Célibataire","Ledig"]
[null,null,null,null,null,null,null,null,null,null,null,"Marié(e) ","Verheiratet"]
["N° Référence",null,{"$f":"Calcul!I42","v":0},null,null,null,null,null,null,null,null,"Divorcé(e) ","Geschieden"]
["Nom - Prénom",null,{"$f":"CONCATENATE(Calcul!B42,\" \",Calcul!B44)","v":" "},null,null,null,null,null,null,null,null,"Séparé(e) ","Getrennt"]
["Etat civil",null,{"$f":"Calcul!B46","v":"Célibataire"},null,null,null,null,null,null,null,null,"Veuf(ve)","Witwer (Witwe)"]
[null,null,null,null,null,null,null,null,null,null,null,"Remarié(e) ","Wiederverheiratet"]
[null,null,null,null,null,null,null,null,null,null,null,"Partenariat enregistré","Eingetragene Partnerschaft"]
[]
["Calcul de l'allocation "]
[]
["Formation",null,{"$f":"VLOOKUP(C6,#REF!,10,FALSE)","v":{"$error":"#REF!"}},null,null,null,null,null,null,null,null,"Repas de midi à domicile","Mittagessen zuhause"]
["Lieu de formation",null,{"$f":"VLOOKUP(C6,#REF!,12,FALSE)","v":{"$error":"#REF!"}},null,null,null,null,null,null,null,null,"Repas de midi hors domicile","Mittagessen auswärts"]
["Type de formation",null,"Formation continue",null,null,null,null,null,null,null,null,"Pension et logement hors famille","Unterkunft und Verpflegung ausserhalb der Familie"]
["Catégorie de frais",null,{"$f":"Calcul!A14","v":"Formation secondaire du deuxième degré (Collège, ECCG, Ecoles profesionnelles à plein temps, …)"},null,null,null,null,null,null,null,null,"Pension et logement  hors canton","Unterkunft und Verpflegung ausserhalb des Kantons"]
["Nombre de semestres",null,{"$f":"Calcul!B196","v":2},null,null,null,null,null,null,null,null,"Formation à distance (tertiaire)","Fernstudium"]
[null,null,null,null,null,null,null,null,null,null,null,"Perfectionnement en emploi","Berufsbegleitende Weiterbildung"]
["Montant maximum de frais annuels admis ",null,null,null,{"$f":"Calcul!B37","v":4700},null,null,"Art. 14"]
[null,null,"Frais de repas",{"$f":"Calcul!B34","v":0}]
[null,null,"Frais de déplacement",{"$f":"Calcul!#REF!","v":{"$error":"#REF!"}}]
[null,null,"Frais de logement",{"$f":"Calcul!#REF!","v":{"$error":"#REF!"}}]
[null,null,"Inscription/Taxes/Ecolage",{"$f":"Calcul!#REF!","v":{"$error":"#REF!"}}]
[]
["Revenu brut maximum",null,null,null,{"$f":"IF(Calcul!H46=2,54000,36000)","v":36000}]
["Nombre d'enfants à charge du(de la) requérant(e )",null,null,{"$f":"Calcul!C48","v":0}]
["Supplément pour enfants à charge (+6'000.- /enfant)",null,null,null,{"$f":"D27*6000","v":0}]
["Revenu brut maximum admis",null,null,null,{"$f":"E26+E28","v":36000}]
[]
["Revenu brut annuel"]
["Revenu de la personne en formation",null,null,null,{"$f":"Calcul!C59","v":0}]
["Pensions alimentaires reçues",null,null,null,{"$f":"Calcul!C60","v":0}]
["Rentes de la personne en formation (AVS, AI,LPP, ...)",null,null,null,{"$f":"Calcul!C61","v":0}]
["Revenu Conjoint",null,null,null,{"$f":"Calcul!C62","v":0}]
["Revenu brut  annuel",null,null,null,{"$f":"SUM(E32:E35)","v":0}]
[]
[]
["Revenu brut maximum admis",null,null,null,{"$f":"E29","v":36000}]
["Revenus brut annuel",null,null,null,{"$f":"E36","v":0}]
{"$rows_left_out":40}